{"text_format":"1","workbook":"xlsx","n_sheets":5,"sheets":["1 Injection molding sheet","2 Analysis","3 Selection fields","4 Language","5 overview"],"not_rendered":{"charts":0,"images":2,"macros":0,"external_links":0,"defined_names":12,"comments":1,"pivot_tables":0},"unopened":[],"bounds":{"document_bytes":16777216,"sheet_cells":100000,"rows_first":2000,"rows_last":500,"rows_between":2000,"halvings":0,"cell_chars":16384,"cell_head_chars":4096},"cells_cut":0,"cells_raw":0,"read":"whole","date_system":"1900"}

{"sheet":"1 Injection molding sheet","index":0,"n_rows":112,"n_cols":38,"rows_kept":112,"cut":false,"hidden":false,"merged":[[53,26,53,27],[55,16,55,20],[55,22,55,23],[55,26,55,27],[53,22,53,23],[50,22,50,23],[56,15,58,27],[54,11,54,12],[51,22,51,23],[52,22,52,23],[57,8,57,12],[58,11,58,12],[19,10,19,12],[18,10,18,12],[29,6,29,7],[44,11,44,12],[39,10,39,12],[48,2,48,13],[29,4,29,5],[28,4,28,5],[37,10,37,12],[34,10,34,12],[29,10,29,11],[32,10,32,12],[28,6,28,7],[28,8,28,9],[29,8,29,9],[28,10,28,11],[28,12,28,13],[31,10,31,12],[29,12,29,13],[22,8,22,9],[24,8,24,9],[20,8,20,9],[109,8,110,13],[54,22,54,23],[54,26,54,27],[34,15,34,17],[34,18,34,20],[34,21,34,23],[34,24,34,26],[95,2,95,13],[98,2,98,13],[106,18,106,27],[102,22,102,27],[107,15,110,27],[108,1,108,6],[102,1,102,6],[110,1,110,6],[45,9,45,10],[44,9,44,10],[51,11,51,12],[65,5,65,6],[75,2,75,13],[89,9,89,13],[56,5,56,6],[87,11,87,12],[90,2,90,13],[65,8,65,9],[80,2,80,13],[81,11,81,12],[102,8,102,13],[102,15,102,20],[66,11,66,12],[62,22,62,27],[80,16,80,27],[65,11,65,12],[82,16,82,27],[74,15,76,27],[69,25,69,26],[70,25,70,26],[68,25,68,26],[66,22,66,27],[63,25,63,26],[62,2,63,13],[86,16,90,27],[26,24,26,26],[36,24,36,26],[36,21,36,23],[46,6,46,13],[47,26,47,27],[47,22,47,23],[48,22,48,23],[45,11,45,12],[52,11,52,12],[50,26,50,27],[51,26,51,27],[50,6,50,13],[29,25,29,26],[52,26,52,27],[43,16,43,27],[0,9,0,13],[13,10,13,12],[12,25,12,26],[24,10,24,12],[10,26,10,27],[12,10,12,12],[11,11,11,12],[11,9,11,10],[14,10,14,12],[22,10,22,12],[16,10,16,12],[1,17,4,27],[7,15,8,18],[11,25,11,26],[10,15,10,23],[21,10,21,12],[5,11,5,17],[5,24,5,27],[6,19,6,22],[5,19,5,22],[2,1,4,15],[15,25,15,26],[0,23,0,27],[6,24,6,27],[6,11,6,17],[36,18,36,20],[48,26,48,27],[49,26,49,27],[17,10,17,12],[15,10,15,12],[13,22,13,26],[15,18,15,19],[17,25,17,26],[17,18,17,19],[31,15,32,27],[37,15,39,27],[26,10,26,12],[36,10,36,12],[44,15,46,27],[36,15,36,17],[49,22,49,23],[25,24,25,26],[43,6,43,13],[24,24,24,26],[23,10,23,12],[38,10,38,12],[20,10,20,12],[10,8,10,13]]}
[null,null,null,null,null,null,null,null,null,{"$f":"HLOOKUP('4 Language'!$B$2,'4 Language'!$C$12:$H$183,2)","v":"Sprachauswahl \n(Select Language)"},null,null,null,null,null,null,null,null,null,null,null,null,null,{"$f":"HLOOKUP('4 Language'!$B$2,'4 Language'!$C$12:$H$183,21)","v":"Auswahl Anwendungsfall"},null,null,null,null,null,null,null,null,null,{"$f":"HLOOKUP('4 Language'!$B$2,'4 Language'!$C$12:$H$307,19)","v":"Angaben zur FS [QVP]"}]
[null,{"$f":"HLOOKUP('4 Language'!$B$2,'4 Language'!$C$12:$H$307,4)","v":"TCL - Parameterblatt - Spritzgießen"},null,null,null,null,null,null,null,null,null,null,null,null,null,null,null,{"$f":"HLOOKUP('4 Language'!$B$2,'4 Language'!$C$12:$H$307,8)","v":"Die mit einem * gekennzeichneten Felder sind für die FS (QVP) Pflichteingaben. Über oben stehende Auswahl sind die entsprechenden Felder hervorzuheben. "},null,null,null,null,null,null,null,null,null,null,null,null,null,null,null,{"$f":"HLOOKUP('4 Language'!$B$2,'4 Language'!$C$12:$H$307,20)","v":"Prozess Bewertung"}]
[null,{"$f":"HLOOKUP('4 Language'!$B$2,'4 Language'!$C$12:$H$307,7)","v":"Info: Für Bauteile mit zwei oder mehr Komponenten bitte das dafür vorgesehene Parameterdatenblatt  für 2K / 3K Teile verwenden."},null,null,null,null,null,null,null,null,null,null,null,null,null,null,null,null,null,null,null,null,null,null,null,null,null,null,null,null,null,null,null,{"$f":"HLOOKUP('4 Language'!$B$2,'4 Language'!$C$12:$H$307,130)","v":"Seriennahe Bauteile [Prototypen]"}]
[]
[]
[null,{"$f":"HLOOKUP('4 Language'!$B$2,'4 Language'!$C$12:$H$307,13)","v":"Bauteil I Teilenummer I Zeichnungsnummer"},null,null,null,null,null,null,null,null,null,null,null,null,null,null,null,null,"I",null,null,null,null,"I",null,null,null,null,null,null,null,null,1,"1.R","Auswahl Anwendungsfall"]
[null,{"$f":"HLOOKUP('4 Language'!$B$2,'4 Language'!$C$12:$H$307,12)","v":"Lieferant I Produktionsstandort I Prod. Datum"},null,null,null,null,null,null,null,null,null,null,null,null,null,null,null,null,"I",null,null,null,null,"I",null,null,null,null,null,null,null,null,null,null,"Text oben"]
[]
[null,{"$f":"HLOOKUP('4 Language'!$B$2,'4 Language'!$C$12:$H$307,16)","v":"Angaben zur Maschine und den Fertigungsparametern"},null,null,null,null,null,null,null,null,null,null,null,null,null,null,null,null,null,null,null,null,null,null,null,"Index",{"$f":"'4 Language'!C5","v":"114"},null,null,null,null,null,1,"11.B","Auswahl Maschinenhersteller"]
[null,{"$f":"\"* \"&HLOOKUP('4 Language'!$B$2,'4 Language'!$C$12:$H$307,17)","v":"* Hersteller  I  Typ der Spritzgießmaschine"},null,null,null,null,null,null,null,null,null,null,null,null,null,{"$f":"\"* \"&(HLOOKUP('4 Language'!$B$2,'4 Language'!$C$12:$H$307,54))","v":"* Zylindertemperatur (Profil / Toleranz)"},null,null,null,null,null,null,null,null,null,null,null,null,null,null,null,null,1,"19.X","Auswahl Temperiermedium primär"]
[null,null,null,null,null,null,null,"I",null,null,null,null,null,null,null,null,null,null,null,null,null,null,null,null,"°C","±",null,null,null,null,null,null,1,"20.X","Auswahl Temperiermedium sekundär"]
[null,{"$f":"\"* \"&HLOOKUP('4 Language'!$B$2,'4 Language'!$C$12:$H$307,18)","v":"* Baujahr der Maschine / der Spritzeinheit"},null,null,null,null,null,null,null,null,null,null,null,null,null,{"$f":"HLOOKUP('4 Language'!$B$2,'4 Language'!$C$12:$H$307,55)","v":"Gemessene Massetemperatur nach Extruder"},null,null,null,null,null,null,null,null,null,null,null,"°C",null,null,null,null,1,"43.I","Auswahl Rohstofftyp / Dichte",null,{"$f":"IF('3 Selection fields'!$V$15=2,$J$45,VLOOKUP('3 Selection fields'!V15,'3 Selection fields'!U16:X68,4))","v":"select"},{"$f":"IF('3 Selection fields'!$V$15=2,$J$46,VLOOKUP('3 Selection fields'!V15,'3 Selection fields'!U16:X68,3))","v":"select"}]
[null,{"$f":"\"* \"&(HLOOKUP('4 Language'!$B$2,'4 Language'!$C$12:$H$307,22))","v":"* Maximale Schließkraft"},null,null,null,null,null,null,null,null,null,null,null," kN",null,{"$f":"HLOOKUP('4 Language'!$B$2,'4 Language'!$C$12:$H$307,56)","v":"gemessene Massetemperatur nach Heißkanal"},null,null,null,null,null,null,null,null,null,null,null,"°C",null,null,null,null,1,"56.I","Auswahl Materialeinfärbung"]
[null,{"$f":"\"* \"&(HLOOKUP('4 Language'!$B$2,'4 Language'!$C$12:$H$307,23))","v":"* Eingestellte Schließkraft"},null,null,null,null,null,null,null,null,null,null,null," kN",null,{"$f":"\"* \"&(HLOOKUP('4 Language'!$B$2,'4 Language'!$C$12:$H$307,57))","v":"* Heißkanaltemperaturen"},null,null,null,null,null,null,null,null,null,null,null,"°C",null,null,null,null,1,"57.I","Auswahl Batch Dosierung"]
[null,{"$f":"\"* \"&(HLOOKUP('4 Language'!$B$2,'4 Language'!$C$12:$H$307,24))","v":"* Projizierte Bauteilfläche je Bauteil"},null,null,null,null,null,null,null,null,null,null,null," cm²",null,{"$f":"\"* \"&(HLOOKUP('4 Language'!$B$2,'4 Language'!$C$12:$H$307,58))","v":"* Werkzeugtemperatur (Wert / Toleranz) "},null,null,null,null,null,null,null,null,null,null,null,null,null,null,null,null,1,"62.I","Auswahl Werkzeugtyp"]
{"$rows_left_out":98}
{"sheet":"2 Analysis","index":1,"n_rows":57,"n_cols":50,"rows_kept":57,"cut":false,"hidden":true,"merged":[[26,22,26,23],[1,29,1,30],[34,9,34,10],[25,12,25,13],[17,22,17,23],[15,22,15,23],[43,12,43,13],[38,12,38,13],[37,12,37,13],[36,12,36,13],[35,12,35,13],[34,22,34,23],[32,22,32,23],[30,22,30,23],[24,12,24,13],[31,12,31,13],[32,12,32,13],[29,12,29,13],[31,9,31,10],[42,22,42,23],[39,22,39,23],[24,27,24,28],[26,27,26,28],[28,27,28,28],[30,27,30,28],[21,27,21,28],[24,22,24,23],[18,12,18,13],[47,27,47,28],[49,27,49,28],[56,2,57,13],[48,2,54,12],[23,12,23,13],[22,12,22,13],[44,15,45,19],[45,22,45,23],[32,27,32,28],[34,27,34,28],[36,27,36,28],[39,27,39,28],[42,27,42,28],[45,27,45,28],[45,12,45,13],[44,12,44,13],[27,15,28,19],[34,12,34,13],[29,15,30,19],[31,15,32,19],[28,22,28,23],[32,9,32,10],[30,12,30,13],[25,15,26,19],[22,9,22,10],[23,9,23,10],[8,15,9,19],[12,15,13,19],[5,27,5,28],[5,22,5,23],[7,22,7,23],[7,27,7,28],[11,22,11,23],[9,22,9,23],[15,27,15,28],[13,27,13,28],[11,27,11,28],[9,27,9,28],[14,15,15,19],[13,22,13,23],[11,9,11,10],[19,9,19,10],[18,9,18,10],[16,9,16,10],[19,27,19,28],[10,9,10,10],[19,22,19,23],[17,27,17,28],[49,22,49,23],[47,22,47,23],[38,15,39,19],[41,15,42,19],[37,9,37,10],[38,9,38,10],[33,9,33,10],[21,22,21,23],[40,9,40,10],[41,9,41,10],[39,9,39,10],[43,9,43,10],[45,9,45,10],[44,9,44,10],[35,9,35,10],[36,9,36,10],[24,9,24,10],[25,9,25,10],[26,9,26,10],[29,9,29,10],[30,9,30,10],[0,10,0,30],[23,15,24,19],[33,12,33,13],[36,22,36,23],[33,15,34,19],[26,12,26,13],[19,12,19,13],[0,7,0,9],[15,9,15,10],[14,9,14,10],[4,1,7,13],[13,9,13,10],[12,9,12,10],[17,9,17,10],[15,12,15,13],[14,12,14,13],[13,12,13,13],[12,12,12,13],[11,12,11,13],[10,12,10,13],[9,12,9,13],[17,12,17,13],[16,12,16,13],[9,9,9,10]]}
[null,null,null,null,null,null,null,{"$f":"HLOOKUP('4 Language'!$B$2,'4 Language'!$C$12:$H$170,2)","v":"Sprachauswahl \n(Select Language)"},null,null,{"$f":"HLOOKUP('4 Language'!$B$8,'4 Language'!$C$12:$H$307,232)","v":"Hier wird nur die rechten Blatthälfte: \"Auswertungsbereich\"umgestellt. Die Übernahme aus dem Parameterdatenblatt erfolgt in der hier voreingestellten Sprache."},null,null,null,null,null,null,null,null,null,null,null,null,null,null,null,null,null,null,null,null,null,null,"< Druckbereich"]
[null,{"$f":"HLOOKUP('4 Language'!$B$8,'4 Language'!$C$12:$H$307,200)","v":"BROSE INTERN . Prozess Analyse "},null,null,null,null,null,null,null,null,null,null,null,null,null,{"$f":"HLOOKUP('4 Language'!$B$8,'4 Language'!$C$12:$H$307,202)","v":"Bitte Formeln nicht verändern!"},null,null,null,null,null,null,null,null,null,null,null,null,"index",{"$f":"'4 Language'!C5","v":"114"}]
[]
[null,{"$f":"HLOOKUP('4 Language'!$B$8,'4 Language'!$C$12:$H$307,233)","v":"Übernahme Parameterdatenblatt"},null,null,null,null,null,null,null,{"$f":"HLOOKUP('4 Language'!$B$8,'4 Language'!$C$12:$H$307,234)","v":"TCL"},"s",null,{"$f":"HLOOKUP('4 Language'!$B$8,'4 Language'!$C$12:$H$307,235)","v":"Eingabe"},"s",null,{"$f":"HLOOKUP('4 Language'!$B$8,'4 Language'!$C$12:$H$307,282)","v":"Auswertungsbereich"},null,null,null,null,null,null,"s",{"$f":"HLOOKUP('4 Language'!$B$8,'4 Language'!$C$12:$H$307,234)","v":"TCL"},null,null,null,"s",{"$f":"HLOOKUP('4 Language'!$B$8,'4 Language'!$C$12:$H$307,235)","v":"Eingabe"}]
[null,{"$f":"HLOOKUP('4 Language'!$B$8,'4 Language'!$C$12:$H$307,237)","v":"Im rechten Bereich der Auswertung sind links (graue Felder) die Eingaben aus dem PDS selbst abgebildet, rechts (gelbe Felder) können eigene Werte zur Überprüfung von Optimierungsansätzen eingesetzt werden."}]
[null,null,null,null,null,null,null,null,null,null,null,null,null,null,null,{"$f":"HLOOKUP('4 Language'!$B$8,'4 Language'!$C$12:$H$307,208)","v":"Dosierhub maximal"},null,null,null,null,null,"[mm] ",{"$f":"IF(ISERROR(J16/(PI()/4*POWER(J13/10,2))*10),\"--\",J16/(PI()/4*POWER(J13/10,2))*10)","v":"--"},null,null,null,null,{"$f":"IF(ISERROR(AW16/(PI()/4*POWER(AW13/10,2))*10),\"--\",AW16/(PI()/4*POWER(AW13/10,2))*10)","v":"--"},null,null,null,null,null,"Toleranzgrenzen der Auswertung"]
[null,null,null,null,null,null,null,null,null,null,null,null,null,null,null,null,null,null,null,null,null,null,null,null,null,null,null,null,null,null,null,null,null,"(tolerances of the examination)",null,null,{"$f":"HLOOKUP('4 Language'!$B$8,'4 Language'!$C$12:$H$307,230)","v":"Übergabemaske - bitte keine Änderungen vornehmen!"}]
[null,null,null,null,null,null,null,null,null,null,null,null,null,null,null,{"$f":"HLOOKUP('4 Language'!$B$8,'4 Language'!$C$12:$H$307,209)","v":"Dosierhub eingestellt"},null,null,null,null,null,"[mm] ",{"$f":"IF(ISERROR(J17/(PI()/4*POWER(J13/10,2))*10),\"--\",J17/(PI()/4*POWER(J13/10,2))*10)","v":"--"},null,null,null,null,{"$f":"IF(ISERROR(M17/(PI()/4*POWER(AW13/10,2))*10),\"--\",M17/(PI()/4*POWER(AW13/10,2))*10)","v":"--"}]
[null,null,null,null,null,null,null,null,null,null,null,null,null,null,null,{"$f":"HLOOKUP('4 Language'!$B$8,'4 Language'!$C$12:$H$307,210)","v":"Verhältnis Dosierhub / Schneckendurchmesser"},null,null,null,null,null,null,null,null,null,null,null,null,null,null,null,null,null,null,null,null,{"$f":"HLOOKUP('4 Language'!$B$8,'4 Language'!$C$12:$H$307,22)","v":"Maximale Schließkraft"},null,null,null,null,{"$f":"'1 Injection molding sheet'!K13","v":0}," [kN]"]
[null,{"$f":"HLOOKUP('4 Language'!$B$2,'4 Language'!$C$12:$H$307,22)","v":"Maximale Schließkraft"},null,null,null,null,null,null,"[kN] ",{"$f":"AP9","v":0},null,null,null,null,null,null,null,null,null,null,null,"[xD] ",{"$f":"IF(ISERROR((J17/(PI()/4*POWER(J13/10,2))*10)/J13),\"--\",(J17/(PI()/4*POWER(J13/10,2))*10)/J13)","v":"--"},null,null,null,null,{"$f":"IF(ISERROR((M17/(PI()/4*POWER(AW13/10,2))*10)/AW13),\"--\",(M17/(PI()/4*POWER(AW13/10,2))*10)/AW13)","v":"--"},null,null,null,null,null," green: ≥ 1 to  ≤ 3 /    yellow    / red: < 0,8  or  ≥ 3,3",null,null,{"$f":"HLOOKUP('4 Language'!$B$8,'4 Language'!$C$12:$H$307,23)","v":"Eingestellte Schließkraft"},null,null,null,null,{"$f":"'1 Injection molding sheet'!K14","v":0}," [kN]",null,null,null,null,{"$f":"IF(AW10=J10,\"Ü\",IF(AW10=M10,\"E\",X))","v":"Ü"},{"$f":"IF(M10=\"\",J10,M10)","v":0}]
[null,{"$f":"HLOOKUP('4 Language'!$B$2,'4 Language'!$C$12:$H$307,23)","v":"Eingestellte Schließkraft"},null,null,null,null,null,null,"[kN] ",0,null,null,null,null,null,null,null,null,null,null,null,null,null,null,null,null,null,null,null,null,null,null,null,null,null,null,{"$f":"HLOOKUP('4 Language'!$B$8,'4 Language'!$C$12:$H$307,24)","v":"Projizierte Bauteilfläche je Bauteil"},null,null,null,null,{"$f":"'1 Injection molding sheet'!K15","v":0}," [cm²]",null,null,null,null,{"$f":"IF(AW11=J11,\"Ü\",IF(AW11=M11,\"E\",X))","v":"Ü"},0]
[null,{"$f":"HLOOKUP('4 Language'!$B$2,'4 Language'!$C$12:$H$307,24)","v":"Projizierte Bauteilfläche je Bauteil"},null,null,null,null,null,null,"[cm²] ",0,null,null,null,null,null,{"$f":"HLOOKUP('4 Language'!$B$8,'4 Language'!$C$12:$H$307,211)","v":"Zylinderauslastung"},null,null,null,null,null,"[%] ",{"$f":"IF(ISERROR(J17/J16*100),\"--\",J17/J16*100)","v":"--"},null,null,null,null,{"$f":"IF(ISERROR(M17/AW16*100),\"--\",M17/AW16*100)","v":"--"},null,null,null,null,null," green: ≥ 25  to ≤ 75  /    yellow     / red: < 20  or  > 75",null,null,{"$f":"HLOOKUP('4 Language'!$B$8,'4 Language'!$C$12:$H$307,25)","v":"Schneckendurchmesser"},null,null,null,null,{"$f":"'1 Injection molding sheet'!K17","v":0}," [mm]",null,null,null,null,{"$f":"IF(AW12=J12,\"Ü\",IF(AW12=M12,\"E\",X))","v":"Ü"},0]
[null,{"$f":"HLOOKUP('4 Language'!$B$2,'4 Language'!$C$12:$H$307,25)","v":"Schneckendurchmesser"},null,null,null,null,null,null,"[mm] ",0,null,null,null,null,null,{"$f":"HLOOKUP('4 Language'!$B$8,'4 Language'!$C$12:$H$307,212)&\"  min\"","v":"Gewichtsverhältnis nachdruckfrei zu ausgedrückt  min"},null,null,null,null,null,null,null,null,null,null,null,null,null,null,null,null,null,null,null,null,{"$f":"HLOOKUP('4 Language'!$B$8,'4 Language'!$C$12:$H$307,26)","v":"Schneckenlänge / Schneckendurchmesser Verhältnis"},null,null,null,null,{"$f":"'1 Injection molding sheet'!K18","v":0}," [/1]",null,null,null,null,{"$f":"IF(AW13=J13,\"Ü\",IF(AW13=M13,\"E\",X))","v":"Ü"},0]
[null,{"$f":"HLOOKUP('4 Language'!$B$2,'4 Language'!$C$12:$H$307,190)","v":"L. zu D. Verhältnis Schnecke "},null,null,null,null,null,null,"[/1] ",0,null,null,null,null,null,null,null,null,null,null,null,"[%] ",{"$f":"IF(ISERROR(J36/J38*100),\"--\",J36/J38*100)","v":"--"},null,null,null,null,{"$f":"IF(ISERROR(AW36/AW38*100),\"--\",AW36/AW38*100)","v":"--"},null,null,null,null,null," green:  ≤ 95  to  ≥ 99  /    yellow     / red: < 90  or  > 99",null,null,{"$f":"HLOOKUP('4 Language'!$B$8,'4 Language'!$C$12:$H$307,28)","v":"max. Plastifizierstrom der Maschine (Basis von  PS)"},null,null,null,null,{"$f":"'1 Injection molding sheet'!K19","v":0}," [g/s]",null,null,null,null,{"$f":"IF(AW14=J14,\"Ü\",IF(AW14=M14,\"E\",X))","v":"Ü"},0]
[null,{"$f":"HLOOKUP('4 Language'!$B$2,'4 Language'!$C$12:$H$307,191)","v":"max. Plastifizierstrom Maschine"},null,null,null,null,null,null,"[g/s] ",0,null,null,null,null,null,{"$f":"HLOOKUP('4 Language'!$B$8,'4 Language'!$C$12:$H$307,212)&\"  max\"","v":"Gewichtsverhältnis nachdruckfrei zu ausgedrückt  max"},null,null,null,null,null,null,null,null,null,null,null,null,null,null,null,null,null,null,null,null,{"$f":"HLOOKUP('4 Language'!$B$8,'4 Language'!$C$12:$H$307,29)","v":"Maximal mögliches Dosiervolumen"},null,null,null,null,{"$f":"'1 Injection molding sheet'!K20","v":0}," [cm³]",null,null,"Auswahlliste",null,{"$f":"IF(AW15=J15,\"Ü\",IF(AW15=M15,\"E\",X))","v":"Ü"},0]
{"$rows_left_out":43}
{"sheet":"3 Selection fields","index":2,"n_rows":68,"n_cols":31,"rows_kept":68,"cut":false,"hidden":true,"merged":[]}
["►",null,"►",null,"►",null,"►",null,"►",null,"►",null,"►",null,"►",null,"►",null,"►",null,"►",null,null,null,"►",null,"►","Maschinenhersteller"]
[4," Sprache",null,null,null,null,null,null,null,null,null,null,null,null,null,null,null,null,null,null,null,null,null,null,{"$f":"Z14","v":"69.H - 72.H  Stahlauswahl"}]
[null,null,null,null,null,null,null,null,null,null,null,null,null,null,null,null,null,null,null,null,{"$f":"V14","v":"43.I  Materialauswahl"}]
[null,null,null,null,null,null,null,null,null,null,null,null,null,null,null,null,null,null,{"$f":"T14","v":"94.I   Bauteilentnahme"}]
[null,null,null,null,null,null,null,null,null,null,null,null,null,null,null,null,{"$f":"R14","v":"56.I   Materialeinfärbung  "}]
[null,null,null,null,null,null,null,null,null,null,null,null,null,null,{"$f":"P14","v":"72.W   Angussart"}]
[null,null,null,null,null,null,null,null,null,null,null,null,{"$f":"N14","v":"75.I   Simulationssoftware"}]
[null,null,null,null,null,null,null,null,null,null,{"$f":"L14","v":"68.W   Angaben zum Kaltkanal"}]
[null,null,null,null,null,null,null,null,{"$f":"J14","v":"65.W   Düsenart"}]
[null,null,null,null,null,null,{"$f":"H14","v":"65.I   WZ-Auslegung"}]
[null,null,null,null,{"$f":"F14","v":"62.V   Abindung"}]
[null,null,{"$f":"D14","v":"62.I  Werkzeugtyp"}]
[{"$f":"B14","v":"57.I   Batch"}]
[null,"57.I   Batch",null,"62.I  Werkzeugtyp",null,"62.V   Abindung",null,"65.I   WZ-Auslegung",null,"65.W   Düsenart",null,"68.W   Angaben zum Kaltkanal",null,"75.I   Simulationssoftware",null,"72.W   Angussart",null,"56.I   Materialeinfärbung  ",null,"94.I   Bauteilentnahme","!","43.I  Materialauswahl","Schmelze\n[g/cm³]","Feststoff\n[g/cm³]",null,"69.H - 72.H  Stahlauswahl",null,"11.B  Maschinenhersteller",null,"19.X 20.X  Temperiermedium"]
[null,{"$f":"'1 Injection molding sheet'!AG14","v":1},null,{"$f":"'1 Injection molding sheet'!AG15","v":1},null,{"$f":"'1 Injection molding sheet'!AG16","v":1},null,{"$f":"'1 Injection molding sheet'!$AG$17","v":4},null,{"$f":"'1 Injection molding sheet'!AG18","v":1},null,{"$f":"'1 Injection molding sheet'!AG19","v":1},null,{"$f":"'1 Injection molding sheet'!AG25","v":1},null,{"$f":"'1 Injection molding sheet'!$AG$24","v":1},null,{"$f":"'1 Injection molding sheet'!AG13","v":1},null,{"$f":"'1 Injection molding sheet'!AG26","v":1},null,{"$f":"'1 Injection molding sheet'!AG12","v":1},null,null,null,{"$f":"'1 Injection molding sheet'!AG20&\" / \"&'1 Injection molding sheet'!AG21&\" / \"&'1 Injection molding sheet'!AG22&\" / \"&'1 Injection molding sheet'!AG23","v":"1 / 1 / 1 / 1"},null,{"$f":"'1 Injection molding sheet'!AG9","v":1},null,{"$f":"'1 Injection molding sheet'!AG10","v":1},{"$f":"'1 Injection molding sheet'!AG11","v":1}]
{"$rows_left_out":54}
{"sheet":"4 Language","index":3,"n_rows":599,"n_cols":8,"rows_kept":599,"cut":false,"hidden":true,"merged":[]}
[null,null,null,"►"]
[null,1,"      Festlegung der Sprache","Sprachauswahl"]
[]
[null,null,"Index:","Deutsch"]
[null,null,"114","English"]
[null,null,"Erläuterungen zum Versionswechsel - siehe Startseite","中文"]
[null,null,null,"Slovensky"]
[null,1," Auswahl für Analyse-Seite","Português [BRA]"]
[null,null,null,"Indizierung"]
["Änderungsstand"]
["12…307",0,"Deutsch","English","Chinesisch","Slovensky","Português [BRA]","Indizierung"]
[null,1,1,2,3,4,5,6]
[null,2,"Sprachauswahl \n(Select Language)","Select Language","语言选择 \n(Select Language)","Výber jazyka\n(Select Language)","Selecione a língua\n(Select Language)","Z A2"]
[null,3,"Deutsch","English","英文","Slovensky","Português (BR)","Z A3"]
[null,4,"TCL - Parameterblatt - Spritzgießen","TCL - Parameter Sheet - Injection Molding","TCL - 参数表-注塑成型","TCL - Parametre procesu vstrekovania","TCL - Folha de Parâmetros de Injeção de Termoplástico","Z A4"]
{"$rows_left_out":585}
{"sheet":"5 overview","index":4,"n_rows":78,"n_cols":40,"rows_kept":78,"cut":false,"hidden":true,"merged":[[17,35,17,37],[18,35,18,37],[19,35,19,37],[20,35,20,37],[21,35,21,37],[12,35,12,37],[13,35,13,37],[14,35,14,37],[15,35,15,37],[16,35,16,37],[7,35,7,37],[8,35,8,37],[9,35,9,37],[10,35,10,37],[11,35,11,37],[77,7,77,9],[26,1,27,1],[26,2,27,6],[26,7,27,9],[31,7,31,9],[30,7,30,9],[33,7,33,9],[32,7,32,9],[26,23,27,24],[0,8,0,12],[5,11,5,27],[29,7,29,9],[28,7,28,9],[26,20,27,21],[26,10,27,17],[26,25,27,27]]}
[null,null,null,null,null,null,null,null,{"$f":"HLOOKUP('4 Language'!$B$2,'4 Language'!$C$12:$H$307,2)","v":"Sprachauswahl \n(Select Language)"},null,null,null,null,null,null,null,null,null,null,null,null,null,null,null,null,"Index",null,{"$f":"'4 Language'!C5","v":"114"},null,null,null,"►",null,"Versionsübersicht"]
[null,{"$f":"HLOOKUP('4 Language'!$B$2,'4 Language'!$C$12:$H$307,4)","v":"TCL - Parameterblatt - Spritzgießen"}]
[]
[]
[]
[null,{"$f":"HLOOKUP('4 Language'!$B$2,'4 Language'!$C$12:H307,5)","v":"Navigation"}]
[]
[null,null,null,null,null,null,null,null,null,null,null,null,null,null,null,null,null,null,null,null,null,null,null,null,null,null,null,null,null,null,null,null,null,null,"Index 114","2024-12-02",null,null,"-","Datumszeile zwischen 1K und 2K Version angeglichen"]
[null,null,1,null,{"$f":"HLOOKUP('4 Language'!$B$2,'4 Language'!$C$12:$H$307,4)","v":"TCL - Parameterblatt - Spritzgießen"},null,null,null,null,null,null,null,null,null,null,null,null,null,null,null,null,null,null,null,null,null,null,null,null,null,null,null,null,null,null,null,null,null,"-","\"Datum\" zu \"Prod. Datum\""]
[null,null,null,null,null,null,null,null,null,null,null,null,null,null,null,null,null,null,null,null,null,null,null,null,null,null,null,null,null,null,null,null,null,null,null,null,null,null,"-","neu: Auswahlfeld für Maschinenhersteller "]
[null,null,null,null,null,null,null,null,null,null,null,null,null,null,null,null,null,null,null,null,null,null,null,null,null,null,null,null,null,null,null,null,null,null,null,null,null,null,"-","bedingte Formatierung der Nachkommastellen"]
[null,null,2,null,{"$f":"HLOOKUP('4 Language'!$B$2,'4 Language'!$C$12:$H$307,6)","v":"Auswertungsblatt"},null,null,null,null,null,null,null,null,null,null,null,null,null,null,null,null,null,null,null,null,null,null,null,null,null,null,null,null,null,null,null,null,null,"-","neu: Auswahl Temperiermedium (primär und sekundär)"]
[null,null,null,null,null,null,null,null,null,null,null,null,null,null,null,null,null,null,null,null,null,null,null,null,null,null,null,null,null,null,null,null,null,null,null,null,null,null,"-","Differenzierung Nadeldurchmesser / Anschnittdurchmesser"]
[null,null,null,null,null,null,null,null,null,null,null,null,null,null,null,null,null,null,null,null,null,null,null,null,null,null,null,null,null,null,null,null,null,null,null,null,null,null,"-","Angussanzahl je Bauteil / Düsenanzahl je Werkzeug"]
[null,null,3,null,{"$f":"HLOOKUP('4 Language'!$B$2,'4 Language'!$C$400:$H$600,4)","v":"Auswahlfelder"},null,null,null,null,null,null,null,null,{"$f":"HLOOKUP('4 Language'!$B$2,'4 Language'!$C$400:$H$600,7)","v":"Veränderungen nur durch Administrator zulässig!"},null,null,null,null,null,null,null,null,null,null,null,null,null,null,null,null,null,null,null,null,null,null,null,null,"-","\"Aussortierung von Anfahrteilen\""]
{"$rows_left_out":63}